LINUX.ORG.RU
ФорумGames

Rigs Of Rods 0,36,1


0

0

Он сейчас уже опенсоурсе но, новой версии собраной под Линукс не видать. Сорцы, же с сорсфоржа не собираются, останавливается где то на 80 процентов и пишет что не хватает каких то файлов. И перед самой компиляцией ccmake пишет что Caelium используется более новой версии... Следовал инструкции на их вики. Кубунта 9.04

У кого нибудь эта игра собралась?

Да, я собирал под FreeBSD как чувак у нах на форуме писал: http://forum.rigsofrods.com/index.php?topic=19113.0. Не запускается, правда, так что ждем порта...

PS. Если проблему будешь описывать как `не хватает каких-то файлов', можешь сразу отправляться в сапера играть.

slovazap ★★★★★
()
Ответ на: комментарий от djzielony

Запускаю cmake .. как написано в ридми - все в порядке.

Запустил make -j 3 Жду...


Вот последние строчки лога. Или нужен весь?

[ 87%] Building CXX object dependencies/mygui/CMakeFiles/mygui.dir/src/MyGUI_LanguageManager.cpp.o
[ 87%] Building CXX object dependencies/mygui/CMakeFiles/mygui.dir/src/MyGUI_LayoutManager.cpp.o
[ 87%] Building CXX object dependencies/mygui/CMakeFiles/mygui.dir/src/MyGUI_MenuBarFactory.cpp.o
[ 87%] Building CXX object dependencies/mygui/CMakeFiles/mygui.dir/src/MyGUI_StaticTextFactory.cpp.o
Linking CXX shared library libmygui.so
[ 87%] Built target mygui
make: *** [all] Error 2

djzielony
() автор топика
Ответ на: комментарий от djzielony

omg.

Запусти, во-первых, make без j, потому что при многопотоковой сборке сообщения от разных экземпляров gcc путаются. Во-вторых, запости _сообщение об ошибке_. Не весь лог и не 5 левых строчек, а именно сообщение об ошибке.

slovazap ★★★★★
()
Ответ на: комментарий от slovazap

Linking CXX shared library libmygui.so                                                                                                         
[ 87%] Built target mygui                                                                                                                      
[ 88%] Building CXX object main/CMakeFiles/RoR.dir/source/airbrake.cpp.o                                                                       
In file included from /home/marian/Downloads/ror/0.36.1/build/main/source/airbrake.h:24,                                                       
                 from /home/marian/Downloads/ror/0.36.1/build/main/source/airbrake.cpp:20:                                                     
/home/marian/Downloads/ror/0.36.1/build/main/source/Beam.h:47:20: error: rornet.h: No such file or directory                                   
In file included from /home/marian/Downloads/ror/0.36.1/build/main/source/airbrake.h:24,                                                       
                 from /home/marian/Downloads/ror/0.36.1/build/main/source/airbrake.cpp:20:                                                     
/home/marian/Downloads/ror/0.36.1/build/main/source/Beam.h:923: error: ISO C++ forbids declaration of ‘oob_t’ with no type                     
/home/marian/Downloads/ror/0.36.1/build/main/source/Beam.h:923: error: expected ‘;’ before ‘*’ token                                           
/home/marian/Downloads/ror/0.36.1/build/main/source/Beam.h:924: error: ISO C++ forbids declaration of ‘oob_t’ with no type                     
/home/marian/Downloads/ror/0.36.1/build/main/source/Beam.h:924: error: expected ‘;’ before ‘*’ token                                           
/home/marian/Downloads/ror/0.36.1/build/main/source/Beam.h:925: error: ISO C++ forbids declaration of ‘oob_t’ with no type                     
/home/marian/Downloads/ror/0.36.1/build/main/source/Beam.h:925: error: expected ‘;’ before ‘*’ token                                           
make[2]: *** [main/CMakeFiles/RoR.dir/source/airbrake.cpp.o] Error 1                                                                           
make[1]: *** [main/CMakeFiles/RoR.dir/all] Error 2                                                                                             
make: *** [all] Error 2  

Это?

djzielony
() автор топика
Ответ на: комментарий от slovazap

Попробуемс, только релиз то старый какой...

djzielony
() автор топика
Ответ на: комментарий от slovazap

[ 88%] Building CXX object main/CMakeFiles/RoR.dir/source/airbrake.cpp.o In file included from /home/marian/Downloads/0.36.1/build/main/source/airbrake.h:24, from /home/marian/Downloads/0.36.1/build/main/source/airbrake.cpp:20: /home/marian/Downloads/0.36.1/build/main/source/Beam.h:47:20: error: rornet.h: No such file or directory In file included from /home/marian/Downloads/0.36.1/build/main/source/airbrake.h:24, from /home/marian/Downloads/0.36.1/build/main/source/airbrake.cpp:20: /home/marian/Downloads/0.36.1/build/main/source/Beam.h:923: error: ISO C++ forbids declaration of ‘oob_t’ with no type /home/marian/Downloads/0.36.1/build/main/source/Beam.h:923: error: expected ‘;’ before ‘*’ token /home/marian/Downloads/0.36.1/build/main/source/Beam.h:924: error: ISO C++ forbids declaration of ‘oob_t’ with no type /home/marian/Downloads/0.36.1/build/main/source/Beam.h:924: error: expected ‘;’ before ‘*’ token /home/marian/Downloads/0.36.1/build/main/source/Beam.h:925: error: ISO C++ forbids declaration of ‘oob_t’ with no type /home/marian/Downloads/0.36.1/build/main/source/Beam.h:925: error: expected ‘;’ before ‘*’ token make[2]: *** [main/CMakeFiles/RoR.dir/source/airbrake.cpp.o] Error 1 make[1]: *** [main/CMakeFiles/RoR.dir/all] Error 2 make: *** [all] Error 2

Ничего не понимаю, что, сорцы плохо написаны?

djzielony
() автор топика
Ответ на: комментарий от djzielony

оооой форматирование:


[ 88%] Building CXX object main/CMakeFiles/RoR.dir/source/airbrake.cpp.o                                                                       
In file included from /home/marian/Downloads/0.36.1/build/main/source/airbrake.h:24,                                                           
                 from /home/marian/Downloads/0.36.1/build/main/source/airbrake.cpp:20:                                                         
/home/marian/Downloads/0.36.1/build/main/source/Beam.h:47:20: error: rornet.h: No such file or directory                                       
In file included from /home/marian/Downloads/0.36.1/build/main/source/airbrake.h:24,                                                           
                 from /home/marian/Downloads/0.36.1/build/main/source/airbrake.cpp:20:                                                         
/home/marian/Downloads/0.36.1/build/main/source/Beam.h:923: error: ISO C++ forbids declaration of ‘oob_t’ with no type                         
/home/marian/Downloads/0.36.1/build/main/source/Beam.h:923: error: expected ‘;’ before ‘*’ token
/home/marian/Downloads/0.36.1/build/main/source/Beam.h:924: error: ISO C++ forbids declaration of ‘oob_t’ with no type
/home/marian/Downloads/0.36.1/build/main/source/Beam.h:924: error: expected ‘;’ before ‘*’ token
/home/marian/Downloads/0.36.1/build/main/source/Beam.h:925: error: ISO C++ forbids declaration of ‘oob_t’ with no type
/home/marian/Downloads/0.36.1/build/main/source/Beam.h:925: error: expected ‘;’ before ‘*’ token
make[2]: *** [main/CMakeFiles/RoR.dir/source/airbrake.cpp.o] Error 1
make[1]: *** [main/CMakeFiles/RoR.dir/all] Error 2
make: *** [all] Error 2

djzielony
() автор топика
Ответ на: комментарий от djzielony

После чекаута из свн все скомпилилось, но теперь при запуске rorconfig.sh  выдает: 

*куча текста о том как все хорошо*
 
Installing plugin: Octree & Terrain Scene Manager
Plugin successfully installed
Loading library ./Plugin_CgProgramManager
Installing plugin: Cg Program Manager
Plugin successfully installed
*-*-* OGRE Initialising
*-*-* Version 1.4.9 (Eihort)
./rorconfig.sh: line 4:  2712 Segmentation fault      (core dumped) $BASEDIR/rorconfig $@

Как починить? Почему Огр сегфаултится может?

djzielony
() автор топика
Ответ на: комментарий от djzielony

Ах да еще перед этим есть такое сообщение: 
lang file: /                                                                       
language existing, using it!                                                       

(rorconfig:16114): Gtk-CRITICAL **: gtk_window_resize: assertion `width > 0' failed
Creating resource group General                                                 

djzielony
() автор топика
Вы не можете добавлять комментарии в эту тему. Тема перемещена в архив.